Reaction Details
TargetPantothenate kinase 3
LigandBDBM50071455
Substrate/Competitorn/a
Meas. Tech.ChEMBL_1469797 (CHEMBL3413791)
IC50 120±n/a nM
Citation Sharma, LKLeonardi, RLin, WBoyd, VAGoktug, AShelat, AAChen, TJackowski, SRock, CO A high-throughput screen reveals new small-molecule activators and inhibitors of pantothenate kinases. J Med Chem58:1563-8 (2015) 
 
Pantothenate kinase 3
Name:Pantothenate kinase 3
Type:PROTEIN
Mol. Mass.:41093.59
Organism:Homo sapiens (Human)
Description:ChEMBL_109587
Residue:370
BDBM50071455
NameBDBM50071455
Synonyms:CHEMBL3410245
TypeSmall organic molecule
Emp. Form.C21H23N3O2S
Mol. Mass.381.491
SMILESCC(C)c1ccc(NC(=O)CCc2nc(O)c3c4CCCc4sc3n2)cc1