Reaction Details
TargetPantothenate kinase 3
LigandBDBM50071472
Substrate/Competitorn/a
Meas. Tech.ChEMBL_1469797 (CHEMBL3413791)
IC50 10050±n/a nM
Citation Sharma, LKLeonardi, RLin, WBoyd, VAGoktug, AShelat, AAChen, TJackowski, SRock, CO A high-throughput screen reveals new small-molecule activators and inhibitors of pantothenate kinases. J Med Chem58:1563-8 (2015) 
 
Pantothenate kinase 3
Name:Pantothenate kinase 3
Type:PROTEIN
Mol. Mass.:41093.59
Organism:Homo sapiens (Human)
Description:ChEMBL_109587
Residue:370
BDBM50071472
NameBDBM50071472
Synonyms:CHEMBL3410394
TypeSmall organic molecule
Emp. Form.C21H20FN5O
Mol. Mass.377.4148
SMILESCc1nc2c3cccnc3nn2c(C)c1CCC(=O)NCc1cccc(F)c1