Reaction Details
TargetPantothenate kinase 3
LigandBDBM50071382
Substrate/Competitorn/a
Meas. Tech.ChEMBL_1469797 (CHEMBL3413791)
IC50 1640±n/a nM
Citation Sharma, LKLeonardi, RLin, WBoyd, VAGoktug, AShelat, AAChen, TJackowski, SRock, CO A high-throughput screen reveals new small-molecule activators and inhibitors of pantothenate kinases. J Med Chem58:1563-8 (2015) 
 
Pantothenate kinase 3
Name:Pantothenate kinase 3
Type:PROTEIN
Mol. Mass.:41093.59
Organism:Homo sapiens (Human)
Description:ChEMBL_109587
Residue:370
BDBM50071382
NameBDBM50071382
Synonyms:CHEMBL1555019
TypeSmall organic molecule
Emp. Form.C21H21N5O2
Mol. Mass.375.4237
SMILESCOc1cccc(NC(=O)CCc2c(C)nc3c4cccnc4nn3c2C)c1