Reaction Details
TargetPantothenate kinase 3
LigandBDBM50071384
Substrate/Competitorn/a
Meas. Tech.ChEMBL_1469797 (CHEMBL3413791)
IC50 25840±n/a nM
Citation Sharma, LKLeonardi, RLin, WBoyd, VAGoktug, AShelat, AAChen, TJackowski, SRock, CO A high-throughput screen reveals new small-molecule activators and inhibitors of pantothenate kinases. J Med Chem58:1563-8 (2015) 
 
Pantothenate kinase 3
Name:Pantothenate kinase 3
Type:PROTEIN
Mol. Mass.:41093.59
Organism:Homo sapiens (Human)
Description:ChEMBL_109587
Residue:370
BDBM50071384
NameBDBM50071384
Synonyms:CHEMBL1603189
TypeSmall organic molecule
Emp. Form.C22H23N5O2
Mol. Mass.389.4503
SMILESCOc1ccc(CNC(=O)CCc2c(C)nc3c4cccnc4nn3c2C)cc1