Reaction Details
TargetPantothenate kinase 1
LigandBDBM50071461
Substrate/Competitorn/a
Meas. Tech.ChEMBL_1469796 (CHEMBL3413790)
IC50 13610±n/a nM
Citation Sharma, LKLeonardi, RLin, WBoyd, VAGoktug, AShelat, AAChen, TJackowski, SRock, CO A high-throughput screen reveals new small-molecule activators and inhibitors of pantothenate kinases. J Med Chem58:1563-8 (2015) 
 
Pantothenate kinase 1
Name:Pantothenate kinase 1
Type:PROTEIN
Mol. Mass.:64345.71
Organism:Homo sapiens (Human)
Description:ChEMBL_109585
Residue:598
BDBM50071461
NameBDBM50071461
Synonyms:CHEMBL3410251
TypeSmall organic molecule
Emp. Form.C20H25N5O
Mol. Mass.351.4454
SMILESCc1nc2c3cccnc3nn2c(C)c1CCC(=O)NC1CCCCC1