Reaction Details
TargetPantothenate kinase 3
LigandBDBM50071513
Substrate/Competitorn/a
Meas. Tech.ChEMBL_1469804 (CHEMBL3413798)
EC50 2410±n/a nM
Citation Sharma, LKLeonardi, RLin, WBoyd, VAGoktug, AShelat, AAChen, TJackowski, SRock, CO A high-throughput screen reveals new small-molecule activators and inhibitors of pantothenate kinases. J Med Chem58:1563-8 (2015) 
 
Pantothenate kinase 3
Name:Pantothenate kinase 3
Type:PROTEIN
Mol. Mass.:41093.59
Organism:Homo sapiens (Human)
Description:ChEMBL_109587
Residue:370
BDBM50071513
NameBDBM50071513
Synonyms:CHEMBL3410240
TypeSmall organic molecule
Emp. Form.C19H22FN3O
Mol. Mass.327.3959
SMILESCc1ccc(NC(=O)N2CCN(CC2)c2ccccc2F)c(C)c1