Reaction Details
TargetPantothenate kinase 3
LigandBDBM50071569
Substrate/Competitorn/a
Meas. Tech.ChEMBL_1469804 (CHEMBL3413798)
EC50 3430±n/a nM
Citation Sharma, LKLeonardi, RLin, WBoyd, VAGoktug, AShelat, AAChen, TJackowski, SRock, CO A high-throughput screen reveals new small-molecule activators and inhibitors of pantothenate kinases. J Med Chem58:1563-8 (2015) 
 
Pantothenate kinase 3
Name:Pantothenate kinase 3
Type:PROTEIN
Mol. Mass.:41093.59
Organism:Homo sapiens (Human)
Description:ChEMBL_109587
Residue:370
BDBM50071569
NameBDBM50071569
Synonyms:CHEMBL3410243
TypeSmall organic molecule
Emp. Form.C12H18N6
Mol. Mass.246.3115
SMILESCCN(CC)c1ccc(CNc2nn[nH]n2)cc1