Reaction Details
TargetKrueppel-like factor 10
LigandBDBM50071808
Substrate/Competitorn/a
Meas. Tech.ChEMBL_1467056 (CHEMBL3411253)
IC50 200000±n/a nM
Citation Khedkar, SASun, XRigby, ACFeinberg, MW Discovery of small molecule inhibitors to Krüppel-like factor 10 (KLF10): implications for modulation of T regulatory cell differentiation. J Med Chem58:1466-78 (2015) 
 
Krueppel-like factor 10
Name:Krueppel-like factor 10
Type:PROTEIN
Mol. Mass.:52579.81
Organism:Homo sapiens (Human)
Description:ChEMBL_109571
Residue:480
BDBM50071808
NameBDBM50071808
Synonyms:CHEMBL490514
TypeSmall organic molecule
Emp. Form.C9H10O4
Mol. Mass.182.1733
SMILESCOc1cc(O)c(C(C)=O)c(O)c1