Reaction Details
TargetFolate receptor alpha
LigandBDBM50072398
Substrate/Competitorn/a
Meas. Tech.ChEMBL_1469596 (CHEMBL3412691)
IC50>1000±n/a nM
Citation Wang, YMitchell-Ryan, SRaghavan, SGeorge, COrr, SHou, ZMatherly, LHGangjee, A Novel 5-substituted pyrrolo[2,3-d]pyrimidines as dual inhibitors of glycinamide ribonucleotide formyltransferase and 5-aminoimidazole-4-carboxamide ribonucleotide formyltransferase and as potential antitumor agents. J Med Chem58:1479-93 (2015) 
 
Folate receptor alpha
Name:Folate receptor alpha
Type:PROTEIN
Mol. Mass.:29827.41
Organism:Homo sapiens (Human)
Description:ChEMBL_1469596
Residue:257
BDBM50072398
NameBDBM50072398
Synonyms:CHEMBL2426245
TypeSmall organic molecule
Emp. Form.C17H17N5O6S
Mol. Mass.419.412
SMILESNc1nc2[nH]cc(Cc3ccc(s3)C(=O)N[C@@H](CCC(O)=O)C(O)=O)c2c(=O)[nH]1