Reaction Details
TargetNitric oxide synthase, brain
LigandBDBM50278675
Substrate/Competitorn/a
Meas. Tech.ChEMBL_1469607 (CHEMBL3412864)
Ki 7.0±n/a nM
Citation Annedi, SC Cell-permeable inhibitors of neuronal nitric oxide synthase open new prospects for the treatment of neurological disorders. J Med Chem58:1064-6 (2015) 
 
Nitric oxide synthase, brain
Name:Nitric oxide synthase, brain
Type:Enzyme
Mol. Mass.:160570.98
Organism:Rattus norvegicus (rat)
Description:Recombinant nNOS overexpressed in E. coli was used in enzyme assays.
Residue:1429
BDBM50278675
NameBDBM50278675
Synonyms:(+/-)-cis-6-((4-(2-(3-Fluorophenethylamino)-ethoxy)-pyrrolidin-3-yl)methyl)-4-methyl-pyridin-2-amine CHEMBL1278038 | CHEMBL469987
TypeSmall organic molecule
Emp. Form.C21H29FN4O
Mol. Mass.372.4796
SMILESCc1cc(N)nc(C[C@H]2CNC[C@H]2OCCNCCc2cccc(F)c2)c1