Reaction Details
TargetMitogen-activated protein kinase 1
LigandBDBM50072460
Substrate/Competitorn/a
Meas. Tech.ChEMBL_1469629 (CHEMBL3412886)
Ki 0.400000±n/a nM
Citation Ren, LGrina, JMoreno, DBlake, JFGaudino, JJGarrey, RMetcalf, ATBurkard, MMartinson, MRasor, KChen, HDean, BGould, SEPacheco, PShahidi-Latham, SYin, JWest, KWang, WMoffat, JGSchwarz, JB Discovery of highly potent, selective, and efficacious small molecule inhibitors of ERK1/2. J Med Chem58:1976-91 (2015) 
 
Mitogen-activated protein kinase 1
Name:Mitogen-activated protein kinase 1
Type:Ser/Thr Protein Kinase
Mol. Mass.:41392.76
Organism:Homo sapiens (Human)
Description:P28482
Residue:360
BDBM50072460
NameBDBM50072460
Synonyms:CHEMBL3409603
TypeSmall organic molecule
Emp. Form.C20H18ClFN4O3
Mol. Mass.416.833
SMILESOC[C@H](c1ccc(Cl)c(F)c1)n1ccc(cc1=O)-c1ccnc(NC2COC2)n1