Reaction Details
TargetMitogen-activated protein kinase 1
LigandBDBM50072464
Substrate/Competitorn/a
Meas. Tech.ChEMBL_1469629 (CHEMBL3412886)
Ki 6.8±n/a nM
Citation Ren, LGrina, JMoreno, DBlake, JFGaudino, JJGarrey, RMetcalf, ATBurkard, MMartinson, MRasor, KChen, HDean, BGould, SEPacheco, PShahidi-Latham, SYin, JWest, KWang, WMoffat, JGSchwarz, JB Discovery of highly potent, selective, and efficacious small molecule inhibitors of ERK1/2. J Med Chem58:1976-91 (2015) 
 
Mitogen-activated protein kinase 1
Name:Mitogen-activated protein kinase 1
Type:Ser/Thr Protein Kinase
Mol. Mass.:41392.76
Organism:Homo sapiens (Human)
Description:P28482
Residue:360
BDBM50072464
NameBDBM50072464
Synonyms:CHEMBL3409607
TypeSmall organic molecule
Emp. Form.C22H24ClFN4O3
Mol. Mass.446.902
SMILESCOCC[C@H](C)Nc1nccc(n1)-c1ccn([C@H](CO)c2ccc(Cl)c(F)c2)c(=O)c1