Reaction Details
TargetMitogen-activated protein kinase 1
LigandBDBM120092
Substrate/Competitorn/a
Meas. Tech.ChEMBL_1469629 (CHEMBL3412886)
Ki 1.7±n/a nM
Citation Ren, LGrina, JMoreno, DBlake, JFGaudino, JJGarrey, RMetcalf, ATBurkard, MMartinson, MRasor, KChen, HDean, BGould, SEPacheco, PShahidi-Latham, SYin, JWest, KWang, WMoffat, JGSchwarz, JB Discovery of highly potent, selective, and efficacious small molecule inhibitors of ERK1/2. J Med Chem58:1976-91 (2015) 
 
Mitogen-activated protein kinase 1
Name:Mitogen-activated protein kinase 1
Type:Ser/Thr Protein Kinase
Mol. Mass.:41392.76
Organism:Homo sapiens (Human)
Description:P28482
Residue:360
BDBM120092
NameBDBM120092
Synonyms:US8697715, 14 | US9259470, 14
TypeSmall organic molecule
Emp. Form.C21H21ClFN5O3
Mol. Mass.445.875
SMILESOCC(c1ccc(Cl)c(F)c1)n1ccc(nc1=O)-c1ccnc(NC2CCOCC2)n1