Reaction Details
TargetMitogen-activated protein kinase 1
LigandBDBM50072601
Substrate/Competitorn/a
Meas. Tech.ChEMBL_1469629 (CHEMBL3412886)
Ki 0.400000±n/a nM
Citation Ren, LGrina, JMoreno, DBlake, JFGaudino, JJGarrey, RMetcalf, ATBurkard, MMartinson, MRasor, KChen, HDean, BGould, SEPacheco, PShahidi-Latham, SYin, JWest, KWang, WMoffat, JGSchwarz, JB Discovery of highly potent, selective, and efficacious small molecule inhibitors of ERK1/2. J Med Chem58:1976-91 (2015) 
 
Mitogen-activated protein kinase 1
Name:Mitogen-activated protein kinase 1
Type:Ser/Thr Protein Kinase
Mol. Mass.:41392.76
Organism:Homo sapiens (Human)
Description:P28482
Residue:360
BDBM50072601
NameBDBM50072601
Synonyms:CHEMBL3409572
TypeSmall organic molecule
Emp. Form.C22H23ClN4O3
Mol. Mass.426.896
SMILESOCC(c1ccccc1Cl)n1ccc(cc1=O)-c1ccnc(NC2CCOCC2)n1