Reaction Details
TargetReceptor tyrosine-protein kinase erbB-2
LigandBDBM50073942
Substrate/Competitorn/a
Meas. Tech.ChEMBL_1467839 (CHEMBL3412564)
IC50 21±n/a nM
Citation Buron, FMérour, JYAkssira, MGuillaumet, GRoutier, S Recent advances in the chemistry and biology of pyridopyrimidines. Eur J Med Chem95:76-95 (2015) 
 
Receptor tyrosine-protein kinase erbB-2
Name:Receptor tyrosine-protein kinase erbB-2
Type:n/a
Mol. Mass.:137894.47
Organism:Homo sapiens (Human)
Description:P04626
Residue:1255
BDBM50073942
NameBDBM50073942
Synonyms:CHEMBL3409483
TypeSmall organic molecule
Emp. Form.C29H26FN5O3S
Mol. Mass.543.612
SMILES[O-][S+]1CCN(Cc2ccc(o2)-c2cc3c(Nc4ccc(OCc5cccc(F)c5)cc4)ncnc3cn2)CC1