Reaction Details
TargetReceptor tyrosine-protein kinase erbB-2
LigandBDBM50073943
Substrate/Competitorn/a
Meas. Tech.ChEMBL_1467839 (CHEMBL3412564)
IC50 30±n/a nM
Citation Buron, FMérour, JYAkssira, MGuillaumet, GRoutier, S Recent advances in the chemistry and biology of pyridopyrimidines. Eur J Med Chem95:76-95 (2015) 
 
Receptor tyrosine-protein kinase erbB-2
Name:Receptor tyrosine-protein kinase erbB-2
Type:n/a
Mol. Mass.:137894.47
Organism:Homo sapiens (Human)
Description:P04626
Residue:1255
BDBM50073943
NameBDBM50073943
Synonyms:CHEMBL3409482
TypeSmall organic molecule
Emp. Form.C24H23N7O
Mol. Mass.425.4857
SMILESCN(CCO)c1cc2c(Nc3ccc4n(Cc5ccccc5)ncc4c3)ncnc2cn1