Reaction Details
TargetFalcipain 2
LigandBDBM50074134
Substrate/Competitorn/a
Meas. Tech.ChEMBL_1468093 (CHEMBL3413866)
Ki>100000±n/a nM
Citation Chakka, SKKalamuddin, MSundararaman, SWei, LMundra, SMahesh, RMalhotra, PMohmmed, AKotra, LP Identification of novel class of falcipain-2 inhibitors as potential antimalarial agents. Bioorg Med Chem23:2221-40 (2015) 
 
Falcipain 2
Name:Falcipain 2
Type:Enzyme
Mol. Mass.:55912.60
Organism:Plasmodium falciparum
Description:Recombinant falcipain-2.
Residue:484
BDBM50074134
NameBDBM50074134
Synonyms:CHEMBL3409911
TypeSmall organic molecule
Emp. Form.C40H56FN5O7
Mol. Mass.737.9003
SMILESCOC(=O)C1CCN(CC(=O)N[C@@H](CC(C)C)C(=O)N[C@@H](CC(C)C)C(=O)N[C@H](C(=O)N2CCC[C@H]2COc2ccc(F)cc2)c2ccccc2)CC1