Reaction Details
TargetFalcipain 2
LigandBDBM50074212
Substrate/Competitorn/a
Meas. Tech.ChEMBL_1468093 (CHEMBL3413866)
Ki 10600±n/a nM
Citation Chakka, SKKalamuddin, MSundararaman, SWei, LMundra, SMahesh, RMalhotra, PMohmmed, AKotra, LP Identification of novel class of falcipain-2 inhibitors as potential antimalarial agents. Bioorg Med Chem23:2221-40 (2015) 
 
Falcipain 2
Name:Falcipain 2
Type:Enzyme
Mol. Mass.:55912.60
Organism:Plasmodium falciparum
Description:Recombinant falcipain-2.
Residue:484
BDBM50074212
NameBDBM50074212
Synonyms:CHEMBL3409898
TypeSmall organic molecule
Emp. Form.C40H55FN8O5
Mol. Mass.746.9137
SMILESCC(C)C[C@H](NC(=O)CN1CCN(C)CC1)C(=O)N[C@@H](CC(C)C)C(=O)N[C@@H](Cc1c[nH]c2ccccc12)C(=O)N1CCN=C1COc1ccc(F)cc1