Reaction Details
TargetGlycogen synthase kinase-3 beta
LigandBDBM50074677
Substrate/Competitorn/a
Meas. Tech.ChEMBL_1468106 (CHEMBL3413879)
IC50 0.450000±n/a nM
Citation Sivaprakasam, PHan, XCiviello, RLJacutin-Porte, SKish, KPokross, MLewis, HAAhmed, NSzapiel, NNewitt, JABaldwin, ETXiao, HKrause, CMPark, HNophsker, MLippy, JSBurton, CRLangley, DRMacor, JEDubowchik, GM Discovery of new acylaminopyridines as GSK-3 inhibitors by a structure guided in-depth exploration of chemical space around a pyrrolopyridinone core. Bioorg Med Chem Lett25:1856-63 (2015) 
 
Glycogen synthase kinase-3 beta
Name:Glycogen synthase kinase-3 beta
Type:Enzyme
Mol. Mass.:46756.38
Organism:Homo sapiens (Human)
Description:P49841
Residue:420
BDBM50074677
NameBDBM50074677
Synonyms:CHEMBL3410090
TypeSmall organic molecule
Emp. Form.C16H18N4O3S
Mol. Mass.346.404
SMILESCC(C)Oc1nc(sc1C(N)=O)-c1ccnc(NC(=O)C2CC2)c1