Reaction Details
TargetGlycogen synthase kinase-3 beta
LigandBDBM50074681
Substrate/Competitorn/a
Meas. Tech.ChEMBL_1468106 (CHEMBL3413879)
IC50 1.1±n/a nM
Citation Sivaprakasam, PHan, XCiviello, RLJacutin-Porte, SKish, KPokross, MLewis, HAAhmed, NSzapiel, NNewitt, JABaldwin, ETXiao, HKrause, CMPark, HNophsker, MLippy, JSBurton, CRLangley, DRMacor, JEDubowchik, GM Discovery of new acylaminopyridines as GSK-3 inhibitors by a structure guided in-depth exploration of chemical space around a pyrrolopyridinone core. Bioorg Med Chem Lett25:1856-63 (2015) 
 
Glycogen synthase kinase-3 beta
Name:Glycogen synthase kinase-3 beta
Type:Enzyme
Mol. Mass.:46756.38
Organism:Homo sapiens (Human)
Description:P49841
Residue:420
BDBM50074681
NameBDBM50074681
Synonyms:CHEMBL3410089
TypeSmall organic molecule
Emp. Form.C14H14N4O3S
Mol. Mass.318.351
SMILESCOc1nc(sc1C(N)=O)-c1ccnc(NC(=O)C2CC2)c1