Reaction Details
TargetAldo-keto reductase family 1 member B1
LigandBDBM50134036
Substrate/Competitorn/a
Meas. Tech.ChEMBL_1473106 (CHEMBL3421435)
IC50 77000±n/a nM
Citation Maccari, ROttaną, R Targeting aldose reductase for the treatment of diabetes complications and inflammatory diseases: new insights and future directions. J Med Chem58:2047-67 (2015) 
 
Aldo-keto reductase family 1 member B1
Name:Aldo-keto reductase family 1 member B1
Type:Protein
Mol. Mass.:35855.50
Organism:Homo sapiens (Human)
Description:P15121. 4LAU; 2IKI; 4LB4; 2FZD; 2FZ8; 1US0
Residue:316
BDBM50134036
NameBDBM50134036
Synonyms:2-(2,3-Dimethyl-phenylamino)-benzoic acid 2-(2,3-dimethylphenylamino)benzoic acid CI-473 INF-3355 Ponstel mefanamic acid
TypeSmall organic molecule
Emp. Form.C15H15NO2
Mol. Mass.241.2851
SMILESCc1cccc(Nc2ccccc2C(O)=O)c1C