Reaction Details
TargetDNA (cytosine-5)-methyltransferase 3B
LigandBDBM50430056
Substrate/Competitorn/a
Meas. Tech.ChEMBL_1473708 (CHEMBL3418014)
IC50 7500±n/a nM
Citation Erdmann, AHalby, LFahy, JArimondo, PB Targeting DNA methylation with small molecules: what's next? J Med Chem58:2569-83 (2015) 
 
DNA (cytosine-5)-methyltransferase 3B
Name:DNA (cytosine-5)-methyltransferase 3B
Type:PROTEIN
Mol. Mass.:95771.12
Organism:Homo sapiens (Human)
Description:ChEMBL_1473708
Residue:853
BDBM50430056
NameBDBM50430056
Synonyms:CHEMBL2336409 | SGI-1027
TypeSmall organic molecule
Emp. Form.C27H23N7O
Mol. Mass.461.5178
SMILESCc1cc(Nc2ccc(NC(=O)c3ccc(Nc4ccnc5ccccc45)cc3)cc2)nc(N)n1