Reaction Details
TargetDNA (cytosine-5)-methyltransferase 3A
LigandBDBM50075185
Substrate/Competitorn/a
Meas. Tech.ChEMBL_1473707 (CHEMBL3418013)
IC50 50000±n/a nM
Citation Erdmann, AHalby, LFahy, JArimondo, PB Targeting DNA methylation with small molecules: what's next? J Med Chem58:2569-83 (2015) 
 
DNA (cytosine-5)-methyltransferase 3A
Name:DNA (cytosine-5)-methyltransferase 3A
Type:PROTEIN
Mol. Mass.:101857.24
Organism:Homo sapiens (Human)
Description:ChEMBL_1510405
Residue:912
BDBM50075185
NameBDBM50075185
Synonyms:CHEMBL3414632
TypeSmall organic molecule
Emp. Form.C26H19NO11
Mol. Mass.521.4292
SMILESCC(=O)NCCc1ccc(O)c(c1)-c1cc2C(=O)c3c(cc(O)c(C(O)=O)c3C(O)=O)C(=O)c2c(O)c1O