Reaction Details
TargetDNA (cytosine-5)-methyltransferase 1
LigandBDBM24774
Substrate/Competitorn/a
Meas. Tech.ChEMBL_1473706 (CHEMBL3418012)
IC50 1600±n/a nM
Citation Erdmann, AHalby, LFahy, JArimondo, PB Targeting DNA methylation with small molecules: what's next? J Med Chem58:2569-83 (2015) 
 
DNA (cytosine-5)-methyltransferase 1
Name:DNA (cytosine-5)-methyltransferase 1
Type:Enzyme
Mol. Mass.:183184.85
Organism:Homo sapiens (Human)
Description:P26358
Residue:1616
BDBM24774
NameBDBM24774
Synonyms:2,3-dichloro-1,4-dihydronaphthalene-1,4-dione 2,3-dichloro-1,4-naphthoquinone, 1 | CHEMBL318782
TypeSmall organic molecule
Emp. Form.C10H4Cl2O2
Mol. Mass.227.044
SMILESClC1=C(Cl)C(=O)c2ccccc2C1=O