Reaction Details
TargetDNA (cytosine-5)-methyltransferase 1
LigandBDBM50075192
Substrate/Competitorn/a
Meas. Tech.ChEMBL_1473706 (CHEMBL3418012)
IC50 20000±n/a nM
Citation Erdmann, AHalby, LFahy, JArimondo, PB Targeting DNA methylation with small molecules: what's next? J Med Chem58:2569-83 (2015) 
 
DNA (cytosine-5)-methyltransferase 1
Name:DNA (cytosine-5)-methyltransferase 1
Type:Enzyme
Mol. Mass.:183184.85
Organism:Homo sapiens (Human)
Description:P26358
Residue:1616
BDBM50075192
NameBDBM50075192
Synonyms:CHEMBL3414631
TypeSmall organic molecule
Emp. Form.C15H12N2O4
Mol. Mass.284.2668
SMILESOC(=O)[C@H](Cc1c[nH]c2ccccc12)N1C(=O)C=CC1=O