Reaction Details
TargetLeucyl-cystinyl aminopeptidase
LigandBDBM50076744
Substrate/Competitorn/a
Meas. Tech.ChEMBL_1473486 (CHEMBL3419982)
IC50 30±n/a nM
Citation Papakyriakou, AZervoudi, ETsoukalidou, SMauvais, FXSfyroera, GMastellos, DCvan Endert, PTheodorakis, EAVourloumis, DStratikos, E 3,4-diaminobenzoic acid derivatives as inhibitors of the oxytocinase subfamily of M1 aminopeptidases with immune-regulating properties. J Med Chem58:1524-43 (2015) 
 
Leucyl-cystinyl aminopeptidase
Name:Leucyl-cystinyl aminopeptidase
Type:PROTEIN
Mol. Mass.:117334.10
Organism:Homo sapiens (Human)
Description:ChEMBL_1473494
Residue:1025
BDBM50076744
NameBDBM50076744
Synonyms:CHEMBL3416733
TypeSmall organic molecule
Emp. Form.C27H37N4O4P
Mol. Mass.512.5808
SMILESCC(C)C[C@H](CP(O)(=O)[C@@H](N)CCc1ccccc1)C(=O)N[C@@H](Cc1c[nH]c2ccccc12)C(N)=O