Reaction Details
TargetInduced myeloid leukemia cell differentiation protein Mcl-1
LigandBDBM50078150
Substrate/Competitorn/a
Meas. Tech.ChEMBL_1472592 (CHEMBL3417957)
Ki 130±n/a nM
Citation Bruncko, MWang, LSheppard, GSPhillips, DCTahir, SKXue, JErickson, SFidanze, SFry, EHasvold, LJenkins, GJJin, SJudge, RAKovar, PJMadar, DNimmer, PPark, CPetros, AMRosenberg, SHSmith, MLSong, XSun, CTao, ZFWang, XXiao, YZhang, HTse, CLeverson, JDElmore, SWSouers, AJ Structure-guided design of a series of MCL-1 inhibitors with high affinity and selectivity. J Med Chem58:2180-94 (2015) 
 
Induced myeloid leukemia cell differentiation protein Mcl-1
Name:Induced myeloid leukemia cell differentiation protein Mcl-1
Type:Membrane; Single-pass membrane protein
Mol. Mass.:37332.87
Organism:Homo sapiens (Human)
Description:Q07820
Residue:350
BDBM50078150
NameBDBM50078150
Synonyms:CHEMBL3417581
TypeSmall organic molecule
Emp. Form.C28H23NO3
Mol. Mass.421.4871
SMILESOC(=O)c1[nH]c2c(cccc2c1CCCOc1cccc2ccccc12)-c1ccccc1