Reaction Details
TargetInduced myeloid leukemia cell differentiation protein Mcl-1
LigandBDBM50078152
Substrate/Competitorn/a
Meas. Tech.ChEMBL_1472592 (CHEMBL3417957)
Ki 160±n/a nM
Citation Bruncko, MWang, LSheppard, GSPhillips, DCTahir, SKXue, JErickson, SFidanze, SFry, EHasvold, LJenkins, GJJin, SJudge, RAKovar, PJMadar, DNimmer, PPark, CPetros, AMRosenberg, SHSmith, MLSong, XSun, CTao, ZFWang, XXiao, YZhang, HTse, CLeverson, JDElmore, SWSouers, AJ Structure-guided design of a series of MCL-1 inhibitors with high affinity and selectivity. J Med Chem58:2180-94 (2015) 
 
Induced myeloid leukemia cell differentiation protein Mcl-1
Name:Induced myeloid leukemia cell differentiation protein Mcl-1
Type:Membrane; Single-pass membrane protein
Mol. Mass.:37332.87
Organism:Homo sapiens (Human)
Description:Q07820
Residue:350
BDBM50078152
NameBDBM50078152
Synonyms:CHEMBL3417692
TypeSmall organic molecule
Emp. Form.C29H25NO3
Mol. Mass.435.5137
SMILESCc1cccc(c1)-c1cccc2c(CCCOc3cccc4ccccc34)c([nH]c12)C(O)=O