Reaction Details
TargetInduced myeloid leukemia cell differentiation protein Mcl-1
LigandBDBM50078154
Substrate/Competitorn/a
Meas. Tech.ChEMBL_1472593 (CHEMBL3417958)
Ki 470±n/a nM
Citation Bruncko, MWang, LSheppard, GSPhillips, DCTahir, SKXue, JErickson, SFidanze, SFry, EHasvold, LJenkins, GJJin, SJudge, RAKovar, PJMadar, DNimmer, PPark, CPetros, AMRosenberg, SHSmith, MLSong, XSun, CTao, ZFWang, XXiao, YZhang, HTse, CLeverson, JDElmore, SWSouers, AJ Structure-guided design of a series of MCL-1 inhibitors with high affinity and selectivity. J Med Chem58:2180-94 (2015) 
 
Induced myeloid leukemia cell differentiation protein Mcl-1
Name:Induced myeloid leukemia cell differentiation protein Mcl-1
Type:Membrane; Single-pass membrane protein
Mol. Mass.:37332.87
Organism:Homo sapiens (Human)
Description:Q07820
Residue:350
BDBM50078154
NameBDBM50078154
Synonyms:CHEMBL3417694
TypeSmall organic molecule
Emp. Form.C35H36N2O4
Mol. Mass.548.6713
SMILESCc1ccccc1-c1cccc2c(CCCOc3cccc4ccccc34)c(C(O)=O)n(CCN3CCOCC3)c12