Reaction Details
TargetInduced myeloid leukemia cell differentiation protein Mcl-1
LigandBDBM50078158
Substrate/Competitorn/a
Meas. Tech.ChEMBL_1472595 (CHEMBL3417960)
Ki 2.0±n/a nM
Citation Bruncko, MWang, LSheppard, GSPhillips, DCTahir, SKXue, JErickson, SFidanze, SFry, EHasvold, LJenkins, GJJin, SJudge, RAKovar, PJMadar, DNimmer, PPark, CPetros, AMRosenberg, SHSmith, MLSong, XSun, CTao, ZFWang, XXiao, YZhang, HTse, CLeverson, JDElmore, SWSouers, AJ Structure-guided design of a series of MCL-1 inhibitors with high affinity and selectivity. J Med Chem58:2180-94 (2015) 
 
Induced myeloid leukemia cell differentiation protein Mcl-1
Name:Induced myeloid leukemia cell differentiation protein Mcl-1
Type:Membrane; Single-pass membrane protein
Mol. Mass.:37332.87
Organism:Homo sapiens (Human)
Description:Q07820
Residue:350
BDBM50078158
NameBDBM50078158
Synonyms:CHEMBL3417699
TypeSmall organic molecule
Emp. Form.C46H54N6O5
Mol. Mass.770.9582
SMILESCCOC(=O)c1c(CCCOc2cccc3ccccc23)c2cccc(-c3c(C)nn(C)c3COc3ccc(cc3)N3CCNCC3)c2n1CCN1CCOCC1