Reaction Details
TargetInduced myeloid leukemia cell differentiation protein Mcl-1
LigandBDBM50078163
Substrate/Competitorn/a
Meas. Tech.ChEMBL_1472596 (CHEMBL3417961)
Ki 7.9±n/a nM
Citation Bruncko, MWang, LSheppard, GSPhillips, DCTahir, SKXue, JErickson, SFidanze, SFry, EHasvold, LJenkins, GJJin, SJudge, RAKovar, PJMadar, DNimmer, PPark, CPetros, AMRosenberg, SHSmith, MLSong, XSun, CTao, ZFWang, XXiao, YZhang, HTse, CLeverson, JDElmore, SWSouers, AJ Structure-guided design of a series of MCL-1 inhibitors with high affinity and selectivity. J Med Chem58:2180-94 (2015) 
 
Induced myeloid leukemia cell differentiation protein Mcl-1
Name:Induced myeloid leukemia cell differentiation protein Mcl-1
Type:Membrane; Single-pass membrane protein
Mol. Mass.:37332.87
Organism:Homo sapiens (Human)
Description:Q07820
Residue:350
BDBM50078163
NameBDBM50078163
Synonyms:CHEMBL3417704
TypeSmall organic molecule
Emp. Form.C46H55N7O7S
Mol. Mass.850.037
SMILESCN(C)S(=O)(=O)N1CCN(CC1)c1ccc(OCc2c(c(C)nn2C)-c2cccc3c(CCCOc4cccc5ccccc45)c(C(O)=O)n(CCN4CCOCC4)c23)cc1