Reaction Details
TargetAmine oxidase [flavin-containing] B
LigandBDBM50078898
Substrate/Competitorn/a
Meas. Tech.ChEMBL_1472636 (CHEMBL3418205)
IC50 84700±n/a nM
Citation Valente, SRodriguez, VMercurio, CVianello, PSaponara, BCirilli, RCiossani, GLabella, DMarrocco, BMonaldi, DRuoppolo, GTilset, MBotrugno, OADessanti, PMinucci, SMattevi, AVarasi, MMai, A Pure enantiomers of benzoylamino-tranylcypromine: LSD1 inhibition, gene modulation in human leukemia cells and effects on clonogenic potential of murine promyelocytic blasts. Eur J Med Chem94:163-74 (2015) 
 
Amine oxidase [flavin-containing] B
Name:Amine oxidase [flavin-containing] B
Type:Protein
Mol. Mass.:58768.76
Organism:Homo sapiens (Human)
Description:P27338
Residue:520
BDBM50078898
NameBDBM50078898
Synonyms:CHEMBL3416429
TypeSmall organic molecule
Emp. Form.C16H17ClN2O
Mol. Mass.288.772
SMILESCl.N[C@@H]1C[C@H]1c1cccc(NC(=O)c2ccccc2)c1