Reaction Details
TargetCell division protein FtsZ
LigandBDBM50079361
Substrate/Competitorn/a
Meas. Tech.ChEMBL_1470447 (CHEMBL3418981)
IC50 8300±n/a nM
Citation Li, XMa, S Advances in the discovery of novel antimicrobials targeting the assembly of bacterial cell division protein FtsZ. Eur J Med Chem95:1-15 (2015) 
 
Cell division protein FtsZ
Name:Cell division protein FtsZ
Type:Protein
Mol. Mass.:40305.83
Organism:Escherichia coli
Description:P0A9A6
Residue:383
BDBM50079361
NameBDBM50079361
Synonyms:CHEMBL3416824
TypeSmall organic molecule
Emp. Form.C43H36O8
Mol. Mass.680.7411
SMILESOc1ccccc1Cc1ccc(O)c(Cc2c(O)c(Cc3cc(Cc4ccccc4O)ccc3O)c3O[C@@H](CC(=O)c3c2O)c2ccccc2)c1