Reaction Details
TargetHistone deacetylase 1
LigandBDBM24624
Substrate/Competitorn/a
Meas. Tech.ChEMBL_1471123 (CHEMBL3421013)
IC50 390±n/a nM
Citation Zhang, XKong, YZhang, JSu, MZhou, YZang, YLi, JChen, YFang, YZhang, XLu, W Design, synthesis and biological evaluation of colchicine derivatives as novel tubulin and histone deacetylase dual inhibitors. Eur J Med Chem95:127-35 (2015) 
 
Histone deacetylase 1
Name:Histone deacetylase 1
Type:Enzyme
Mol. Mass.:55090.27
Organism:Homo sapiens (Human)
Description:Q13547
Residue:482
BDBM24624
NameBDBM24624
Synonyms:CHEMBL272980 MGCD0103 US10227295, Compound MGCD0103 US9409858, MGCD0103 US9956192, Compound MGCD0103
TypeSmall organic molecule
Emp. Form.C23H20N6O
Mol. Mass.396.4445
SMILESNc1ccccc1NC(=O)c1ccc(CNc2nccc(n2)-c2cccnc2)cc1