Reaction Details
TargetProtein mono-ADP-ribosyltransferase PARP10
LigandBDBM50397960
Substrate/Competitorn/a
Meas. Tech.ChEMBL_1472392 (CHEMBL3420113)
IC50 10600±n/a nM
Citation Ekblad, TLindgren, AEAndersson, CDCaraballo, RThorsell, AGKarlberg, TSpjut, SLinusson, ASchüler, HElofsson, M Towards small molecule inhibitors of mono-ADP-ribosyltransferases. Eur J Med Chem95:546-51 (2015) 
 
Protein mono-ADP-ribosyltransferase PARP10
Name:Protein mono-ADP-ribosyltransferase PARP10
Type:n/a
Mol. Mass.:109953.63
Organism:Homo sapiens (Human)
Description:Q53GL7
Residue:1025
BDBM50397960
NameBDBM50397960
Synonyms:CHEMBL2179989
TypeSmall organic molecule
Emp. Form.C11H10N2O4
Mol. Mass.234.2081
SMILESNC(=O)c1cccc(NC(=O)\C=C/C(O)=O)c1