Reaction Details
TargetProtein mono-ADP-ribosyltransferase PARP14
LigandBDBM50079624
Substrate/Competitorn/a
Meas. Tech.ChEMBL_1472393 (CHEMBL3420114)
IC50>20000±n/a nM
Citation Ekblad, TLindgren, AEAndersson, CDCaraballo, RThorsell, AGKarlberg, TSpjut, SLinusson, ASchüler, HElofsson, M Towards small molecule inhibitors of mono-ADP-ribosyltransferases. Eur J Med Chem95:546-51 (2015) 
 
Protein mono-ADP-ribosyltransferase PARP14
Name:Protein mono-ADP-ribosyltransferase PARP14
Type:n/a
Mol. Mass.:202812.41
Organism:Homo sapiens (Human)
Description:Q460N5
Residue:1801
BDBM50079624
NameBDBM50079624
Synonyms:CHEMBL3414771
TypeSmall organic molecule
Emp. Form.C12H13N3O3
Mol. Mass.247.2499
SMILESCNC(=O)\C=C/C(=O)Nc1cccc(c1)C(N)=O