Reaction Details
TargetProtein mono-ADP-ribosyltransferase PARP14
LigandBDBM50079620
Substrate/Competitorn/a
Meas. Tech.ChEMBL_1472393 (CHEMBL3420114)
IC50 1600±n/a nM
Citation Ekblad, TLindgren, AEAndersson, CDCaraballo, RThorsell, AGKarlberg, TSpjut, SLinusson, ASchüler, HElofsson, M Towards small molecule inhibitors of mono-ADP-ribosyltransferases. Eur J Med Chem95:546-51 (2015) 
 
Protein mono-ADP-ribosyltransferase PARP14
Name:Protein mono-ADP-ribosyltransferase PARP14
Type:n/a
Mol. Mass.:202812.41
Organism:Homo sapiens (Human)
Description:Q460N5
Residue:1801
BDBM50079620
NameBDBM50079620
Synonyms:CHEMBL3414775
TypeSmall organic molecule
Emp. Form.C12H12N2O4
Mol. Mass.248.2347
SMILESCOC(=O)\C=C/C(=O)Nc1cccc(c1)C(N)=O