Reaction Details
TargetProtein mono-ADP-ribosyltransferase PARP10
LigandBDBM50079617
Substrate/Competitorn/a
Meas. Tech.ChEMBL_1472392 (CHEMBL3420113)
IC50 6918±n/a nM
Citation Ekblad, TLindgren, AEAndersson, CDCaraballo, RThorsell, AGKarlberg, TSpjut, SLinusson, ASchüler, HElofsson, M Towards small molecule inhibitors of mono-ADP-ribosyltransferases. Eur J Med Chem95:546-51 (2015) 
 
Protein mono-ADP-ribosyltransferase PARP10
Name:Protein mono-ADP-ribosyltransferase PARP10
Type:n/a
Mol. Mass.:109953.63
Organism:Homo sapiens (Human)
Description:Q53GL7
Residue:1025
BDBM50079617
NameBDBM50079617
Synonyms:CHEMBL3414778
TypeSmall organic molecule
Emp. Form.C13H14N2O3
Mol. Mass.246.2619
SMILESNC(=O)c1cccc(NC(=O)C2CCC(=O)C2)c1