Reaction Details
TargetPoly [ADP-ribose] polymerase 1
LigandBDBM50079616
Substrate/Competitorn/a
Meas. Tech.ChEMBL_1472395 (CHEMBL3420116)
IC50 9550±n/a nM
Citation Ekblad, TLindgren, AEAndersson, CDCaraballo, RThorsell, AGKarlberg, TSpjut, SLinusson, ASchüler, HElofsson, M Towards small molecule inhibitors of mono-ADP-ribosyltransferases. Eur J Med Chem95:546-51 (2015) 
 
Poly [ADP-ribose] polymerase 1
Name:Poly [ADP-ribose] polymerase 1
Type:n/a
Mol. Mass.:113114.22
Organism:Homo sapiens (Human)
Description:P09874
Residue:1014
BDBM50079616
NameBDBM50079616
Synonyms:CHEMBL3414766
TypeSmall organic molecule
Emp. Form.C13H16N2O4
Mol. Mass.264.2771
SMILESCC(C)(CC(=O)Nc1cccc(c1)C(N)=O)C(O)=O