Reaction Details
TargetPoly [ADP-ribose] polymerase 1
LigandBDBM50079623
Substrate/Competitorn/a
Meas. Tech.ChEMBL_1472395 (CHEMBL3420116)
IC50 389±n/a nM
Citation Ekblad, TLindgren, AEAndersson, CDCaraballo, RThorsell, AGKarlberg, TSpjut, SLinusson, ASchüler, HElofsson, M Towards small molecule inhibitors of mono-ADP-ribosyltransferases. Eur J Med Chem95:546-51 (2015) 
 
Poly [ADP-ribose] polymerase 1
Name:Poly [ADP-ribose] polymerase 1
Type:n/a
Mol. Mass.:113114.22
Organism:Homo sapiens (Human)
Description:P09874
Residue:1014
BDBM50079623
NameBDBM50079623
Synonyms:CHEMBL3414772
TypeSmall organic molecule
Emp. Form.C12H13N3O3
Mol. Mass.247.2499
SMILESCNC(=O)\C=C\C(=O)Nc1cccc(c1)C(N)=O