Reaction Details
TargetPoly [ADP-ribose] polymerase 1
LigandBDBM50079622
Substrate/Competitorn/a
Meas. Tech.ChEMBL_1472395 (CHEMBL3420116)
IC50 589±n/a nM
Citation Ekblad, TLindgren, AEAndersson, CDCaraballo, RThorsell, AGKarlberg, TSpjut, SLinusson, ASchüler, HElofsson, M Towards small molecule inhibitors of mono-ADP-ribosyltransferases. Eur J Med Chem95:546-51 (2015) 
 
Poly [ADP-ribose] polymerase 1
Name:Poly [ADP-ribose] polymerase 1
Type:n/a
Mol. Mass.:113114.22
Organism:Homo sapiens (Human)
Description:P09874
Residue:1014
BDBM50079622
NameBDBM50079622
Synonyms:CHEMBL3414773
TypeSmall organic molecule
Emp. Form.C15H17N3O3
Mol. Mass.287.3138
SMILESNC(=O)c1cccc(NC(=O)\C=C/C(=O)N2CCCC2)c1