Reaction Details
TargetPoly [ADP-ribose] polymerase 1
LigandBDBM50079621
Substrate/Competitorn/a
Meas. Tech.ChEMBL_1472395 (CHEMBL3420116)
IC50 851±n/a nM
Citation Ekblad, TLindgren, AEAndersson, CDCaraballo, RThorsell, AGKarlberg, TSpjut, SLinusson, ASchüler, HElofsson, M Towards small molecule inhibitors of mono-ADP-ribosyltransferases. Eur J Med Chem95:546-51 (2015) 
 
Poly [ADP-ribose] polymerase 1
Name:Poly [ADP-ribose] polymerase 1
Type:n/a
Mol. Mass.:113114.22
Organism:Homo sapiens (Human)
Description:P09874
Residue:1014
BDBM50079621
NameBDBM50079621
Synonyms:CHEMBL3414774
TypeSmall organic molecule
Emp. Form.C15H19N3O3
Mol. Mass.289.3297
SMILESCCN(CC)C(=O)\C=C/C(=O)Nc1cccc(c1)C(N)=O