Reaction Details
Target3-oxoacyl-ACP synthase
LigandBDBM50079636
Substrate/Competitorn/a
Meas. Tech.ChEMBL_1472518 (CHEMBL3421140)
IC50 1000±n/a nM
Citation Sahner, JHEmpting, MKamal, AWeidel, EGroh, MBörger, CHartmann, RW Exploring the chemical space of ureidothiophene-2-carboxylic acids as inhibitors of the quorum sensing enzyme PqsD from Pseudomonas aeruginosa. Eur J Med Chem96:14-21 (2015) 
 
3-oxoacyl-ACP synthase
Name:3-oxoacyl-ACP synthase
Type:PROTEIN
Mol. Mass.:36357.84
Organism:Pseudomonas aeruginosa
Description:ChEMBL_109728
Residue:337
BDBM50079636
NameBDBM50079636
Synonyms:CHEMBL2413670
TypeSmall organic molecule
Emp. Form.C13H11NO3
Mol. Mass.229.2313
SMILESOC(c1ccccc1)c1ccccc1[N+]([O-])=O