Reaction Details
Target3-oxoacyl-ACP synthase
LigandBDBM50079637
Substrate/Competitorn/a
Meas. Tech.ChEMBL_1472518 (CHEMBL3421140)
IC50 2000±n/a nM
Citation Sahner, JHEmpting, MKamal, AWeidel, EGroh, MBörger, CHartmann, RW Exploring the chemical space of ureidothiophene-2-carboxylic acids as inhibitors of the quorum sensing enzyme PqsD from Pseudomonas aeruginosa. Eur J Med Chem96:14-21 (2015) 
 
3-oxoacyl-ACP synthase
Name:3-oxoacyl-ACP synthase
Type:PROTEIN
Mol. Mass.:36357.84
Organism:Pseudomonas aeruginosa
Description:ChEMBL_109728
Residue:337
BDBM50079637
NameBDBM50079637
Synonyms:CHEMBL369485
TypeSmall organic molecule
Emp. Form.C7H7NO3
Mol. Mass.153.1354
SMILESOCc1ccccc1[N+]([O-])=O