Reaction Details
Target3-oxoacyl-ACP synthase
LigandBDBM50079638
Substrate/Competitorn/a
Meas. Tech.ChEMBL_1472518 (CHEMBL3421140)
IC50 500±n/a nM
Citation Sahner, JHEmpting, MKamal, AWeidel, EGroh, MBörger, CHartmann, RW Exploring the chemical space of ureidothiophene-2-carboxylic acids as inhibitors of the quorum sensing enzyme PqsD from Pseudomonas aeruginosa. Eur J Med Chem96:14-21 (2015) 
 
3-oxoacyl-ACP synthase
Name:3-oxoacyl-ACP synthase
Type:PROTEIN
Mol. Mass.:36357.84
Organism:Pseudomonas aeruginosa
Description:ChEMBL_109728
Residue:337
BDBM50079638
NameBDBM50079638
Synonyms:CHEMBL3086445
TypeSmall organic molecule
Emp. Form.C22H20N2O6S
Mol. Mass.440.469
SMILESCOc1ccc(cc1)-c1cc(NC(=O)N[C@@H](Cc2ccccc2)C(O)=O)c(s1)C(O)=O