Reaction Details
Target3-oxoacyl-ACP synthase
LigandBDBM50079651
Substrate/Competitorn/a
Meas. Tech.ChEMBL_1472518 (CHEMBL3421140)
IC50 360±n/a nM
Citation Sahner, JHEmpting, MKamal, AWeidel, EGroh, MBörger, CHartmann, RW Exploring the chemical space of ureidothiophene-2-carboxylic acids as inhibitors of the quorum sensing enzyme PqsD from Pseudomonas aeruginosa. Eur J Med Chem96:14-21 (2015) 
 
3-oxoacyl-ACP synthase
Name:3-oxoacyl-ACP synthase
Type:PROTEIN
Mol. Mass.:36357.84
Organism:Pseudomonas aeruginosa
Description:ChEMBL_109728
Residue:337
BDBM50079651
NameBDBM50079651
Synonyms:CHEMBL3414806
TypeSmall organic molecule
Emp. Form.C34H27N3O8S
Mol. Mass.637.658
SMILESOC(c1ccc(cc1)-c1ccc(cc1)-c1cc(NC(=O)N[C@@H](Cc2ccccc2)C(O)=O)c(s1)C(O)=O)c1ccccc1[N+]([O-])=O