Reaction Details
Target3-oxoacyl-ACP synthase
LigandBDBM50079706
Substrate/Competitorn/a
Meas. Tech.ChEMBL_1472518 (CHEMBL3421140)
IC50 7500±n/a nM
Citation Sahner, JHEmpting, MKamal, AWeidel, EGroh, MBörger, CHartmann, RW Exploring the chemical space of ureidothiophene-2-carboxylic acids as inhibitors of the quorum sensing enzyme PqsD from Pseudomonas aeruginosa. Eur J Med Chem96:14-21 (2015) 
 
3-oxoacyl-ACP synthase
Name:3-oxoacyl-ACP synthase
Type:PROTEIN
Mol. Mass.:36357.84
Organism:Pseudomonas aeruginosa
Description:ChEMBL_109728
Residue:337
BDBM50079706
NameBDBM50079706
Synonyms:CHEMBL3414799
TypeSmall organic molecule
Emp. Form.C23H22N2O6S
Mol. Mass.454.496
SMILESCOc1ccc(-c2cc(NC(=O)N[C@@H](Cc3ccccc3)C(O)=O)c(s2)C(O)=O)c(C)c1