Reaction Details
Target3-oxoacyl-ACP synthase
LigandBDBM50079768
Substrate/Competitorn/a
Meas. Tech.ChEMBL_1472518 (CHEMBL3421140)
IC50 19000±n/a nM
Citation Sahner, JHEmpting, MKamal, AWeidel, EGroh, MBörger, CHartmann, RW Exploring the chemical space of ureidothiophene-2-carboxylic acids as inhibitors of the quorum sensing enzyme PqsD from Pseudomonas aeruginosa. Eur J Med Chem96:14-21 (2015) 
 
3-oxoacyl-ACP synthase
Name:3-oxoacyl-ACP synthase
Type:PROTEIN
Mol. Mass.:36357.84
Organism:Pseudomonas aeruginosa
Description:ChEMBL_109728
Residue:337
BDBM50079768
NameBDBM50079768
Synonyms:CHEMBL3414792
TypeSmall organic molecule
Emp. Form.C16H16N2O7S
Mol. Mass.380.372
SMILESCOc1ccc(cc1)-c1cc(NC(=O)N[C@@H](CO)C(O)=O)c(s1)C(O)=O