Reaction Details
Target3-oxoacyl-ACP synthase
LigandBDBM50079773
Substrate/Competitorn/a
Meas. Tech.ChEMBL_1472518 (CHEMBL3421140)
IC50 31300±n/a nM
Citation Sahner, JHEmpting, MKamal, AWeidel, EGroh, MBörger, CHartmann, RW Exploring the chemical space of ureidothiophene-2-carboxylic acids as inhibitors of the quorum sensing enzyme PqsD from Pseudomonas aeruginosa. Eur J Med Chem96:14-21 (2015) 
 
3-oxoacyl-ACP synthase
Name:3-oxoacyl-ACP synthase
Type:PROTEIN
Mol. Mass.:36357.84
Organism:Pseudomonas aeruginosa
Description:ChEMBL_109728
Residue:337
BDBM50079773
NameBDBM50079773
Synonyms:CHEMBL3414787
TypeSmall organic molecule
Emp. Form.C22H20N2O7S
Mol. Mass.456.468
SMILESCOc1ccc(cc1)[C@H](NC(=O)Nc1cc(sc1C(O)=O)-c1ccc(OC)cc1)C(O)=O