Reaction Details
TargetHistone deacetylase 8
LigandBDBM50080007
Substrate/Competitorn/a
Meas. Tech.ChEMBL_1471152 (CHEMBL3421283)
IC50 1060±n/a nM
Citation Sodji, QHKornacki, JRMcDonald, JFMrksich, MOyelere, AK Design and structure activity relationship of tumor-homing histone deacetylase inhibitors conjugated to folic and pteroic acids. Eur J Med Chem96:340-59 (2015) 
 
Histone deacetylase 8
Name:Histone deacetylase 8
Type:Enzyme
Mol. Mass.:41749.60
Organism:Homo sapiens (Human)
Description:Q9BY41
Residue:377
BDBM50080007
NameBDBM50080007
Synonyms:CHEMBL3415963
TypeSmall organic molecule
Emp. Form.C21H26N8O4
Mol. Mass.454.4823
SMILESNc1nc2ncc(CNc3ccc(cc3)C(=O)NCCCCCCC(=O)NO)nc2c(=O)[nH]1